{"text_format":"1","workbook":"xlsx","n_sheets":4,"sheets":["Takvim","Tatiller","HarTekin","Instructions"],"not_rendered":{"charts":0,"images":0,"macros":0,"external_links":0,"defined_names":30,"comments":0,"pivot_tables":0},"unopened":[],"bounds":{"document_bytes":16777216,"sheet_cells":100000,"rows_first":2000,"rows_last":500,"rows_between":2000,"halvings":0,"cell_chars":16384,"cell_head_chars":4096},"cells_cut":0,"cells_raw":0,"read":"whole","date_system":"1900"}

{"sheet":"Takvim","index":0,"n_rows":60,"n_cols":11,"rows_kept":60,"cut":false,"hidden":false,"merged":[[0,8,0,10]]}
["KOMPAKT TAKVİM",null,null,null,null,null,null,null,2012]
[]
["#",null,"Ay",null,"Pt","S","Ç","P","C","Ct","P"]
[]
[{"$f":"INT((E5-DATE(YEAR(E5-WEEKDAY(E5-1)+4),1,3)+WEEKDAY(DATE(YEAR(E5-WEEKDAY(E5-1)+4),1,3))+ 5)/7)","v":52},null,{"$f":"IF(SUM(1*(DAY(E5:K5)=1))>0,K5,\"\")","v":"2012-01-01"},null,{"$f":"F5-1","v":"2011-12-26"},"2011-12-27","2011-12-28","2011-12-29","2011-12-30","2011-12-31",{"$f":"DATE($I$1,1,1)-WEEKDAY(DATE($I$1,1,1))+1","v":"2012-01-01"}]
[{"$f":"INT((E6-DATE(YEAR(E6-WEEKDAY(E6-1)+4),1,3)+WEEKDAY(DATE(YEAR(E6-WEEKDAY(E6-1)+4),1,3))+ 5)/7)","v":1},null,{"$f":"IF(SUM(1*(DAY(E6:K6)=1))>0,K6,\"\")","v":""},null,{"$f":"K5+1","v":"2012-01-02"},{"$f":"E6+1","v":"2012-01-03"},"2012-01-04","2012-01-05","2012-01-06","2012-01-07","2012-01-08"]
[2,null,{"$f":"IF(SUM(1*(DAY(E7:K7)=1))>0,K7,\"\")","v":""},null,"2012-01-09","2012-01-10","2012-01-11","2012-01-12","2012-01-13","2012-01-14","2012-01-15"]
[3,null,{"$f":"IF(SUM(1*(DAY(E8:K8)=1))>0,K8,\"\")","v":""},null,"2012-01-16","2012-01-17","2012-01-18","2012-01-19","2012-01-20","2012-01-21","2012-01-22"]
[4,null,{"$f":"IF(SUM(1*(DAY(E9:K9)=1))>0,K9,\"\")","v":""},null,"2012-01-23","2012-01-24","2012-01-25","2012-01-26","2012-01-27","2012-01-28","2012-01-29"]
[5,null,{"$f":"IF(SUM(1*(DAY(E10:K10)=1))>0,K10,\"\")","v":"2012-02-05"},null,"2012-01-30","2012-01-31","2012-02-01","2012-02-02","2012-02-03","2012-02-04","2012-02-05"]
[6,null,{"$f":"IF(SUM(1*(DAY(E11:K11)=1))>0,K11,\"\")","v":""},null,"2012-02-06","2012-02-07","2012-02-08","2012-02-09","2012-02-10","2012-02-11","2012-02-12"]
[7,null,{"$f":"IF(SUM(1*(DAY(E12:K12)=1))>0,K12,\"\")","v":""},null,"2012-02-13","2012-02-14","2012-02-15","2012-02-16","2012-02-17","2012-02-18","2012-02-19"]
[8,null,{"$f":"IF(SUM(1*(DAY(E13:K13)=1))>0,K13,\"\")","v":""},null,{"$f":"K12+1","v":"2012-02-20"},"2012-02-21","2012-02-22","2012-02-23","2012-02-24","2012-02-25","2012-02-26"]
[9,null,{"$f":"IF(SUM(1*(DAY(E14:K14)=1))>0,K14,\"\")","v":"2012-03-04"},null,"2012-02-27","2012-02-28","2012-02-29","2012-03-01","2012-03-02","2012-03-03","2012-03-04"]
[10,null,{"$f":"IF(SUM(1*(DAY(E15:K15)=1))>0,K15,\"\")","v":""},null,"2012-03-05","2012-03-06","2012-03-07","2012-03-08","2012-03-09","2012-03-10","2012-03-11"]
[11,null,{"$f":"IF(SUM(1*(DAY(E16:K16)=1))>0,K16,\"\")","v":""},null,"2012-03-12","2012-03-13","2012-03-14","2012-03-15","2012-03-16","2012-03-17","2012-03-18"]
[12,null,{"$f":"IF(SUM(1*(DAY(E17:K17)=1))>0,K17,\"\")","v":""},null,"2012-03-19","2012-03-20","2012-03-21","2012-03-22","2012-03-23","2012-03-24","2012-03-25"]
[13,null,{"$f":"IF(SUM(1*(DAY(E18:K18)=1))>0,K18,\"\")","v":"2012-04-01"},null,"2012-03-26","2012-03-27","2012-03-28","2012-03-29","2012-03-30","2012-03-31","2012-04-01"]
[14,null,{"$f":"IF(SUM(1*(DAY(E19:K19)=1))>0,K19,\"\")","v":""},null,"2012-04-02","2012-04-03","2012-04-04","2012-04-05","2012-04-06","2012-04-07","2012-04-08"]
[15,null,{"$f":"IF(SUM(1*(DAY(E20:K20)=1))>0,K20,\"\")","v":""},null,"2012-04-09","2012-04-10","2012-04-11","2012-04-12","2012-04-13","2012-04-14","2012-04-15"]
[16,null,{"$f":"IF(SUM(1*(DAY(E21:K21)=1))>0,K21,\"\")","v":""},null,"2012-04-16","2012-04-17","2012-04-18","2012-04-19","2012-04-20","2012-04-21","2012-04-22"]
[17,null,{"$f":"IF(SUM(1*(DAY(E22:K22)=1))>0,K22,\"\")","v":""},null,"2012-04-23","2012-04-24","2012-04-25","2012-04-26","2012-04-27","2012-04-28","2012-04-29"]
[18,null,{"$f":"IF(SUM(1*(DAY(E23:K23)=1))>0,K23,\"\")","v":"2012-05-06"},null,"2012-04-30","2012-05-01","2012-05-02","2012-05-03","2012-05-04","2012-05-05","2012-05-06"]
[19,null,{"$f":"IF(SUM(1*(DAY(E24:K24)=1))>0,K24,\"\")","v":""},null,"2012-05-07","2012-05-08","2012-05-09","2012-05-10","2012-05-11","2012-05-12","2012-05-13"]
[20,null,{"$f":"IF(SUM(1*(DAY(E25:K25)=1))>0,K25,\"\")","v":""},null,"2012-05-14","2012-05-15","2012-05-16","2012-05-17","2012-05-18","2012-05-19","2012-05-20"]
[21,null,{"$f":"IF(SUM(1*(DAY(E26:K26)=1))>0,K26,\"\")","v":""},null,"2012-05-21","2012-05-22","2012-05-23","2012-05-24","2012-05-25","2012-05-26","2012-05-27"]
[22,null,{"$f":"IF(SUM(1*(DAY(E27:K27)=1))>0,K27,\"\")","v":"2012-06-03"},null,"2012-05-28","2012-05-29","2012-05-30","2012-05-31","2012-06-01","2012-06-02","2012-06-03"]
[23,null,{"$f":"IF(SUM(1*(DAY(E28:K28)=1))>0,K28,\"\")","v":""},null,"2012-06-04","2012-06-05","2012-06-06","2012-06-07","2012-06-08","2012-06-09","2012-06-10"]
[24,null,{"$f":"IF(SUM(1*(DAY(E29:K29)=1))>0,K29,\"\")","v":""},null,"2012-06-11","2012-06-12","2012-06-13","2012-06-14","2012-06-15","2012-06-16","2012-06-17"]
[25,null,{"$f":"IF(SUM(1*(DAY(E30:K30)=1))>0,K30,\"\")","v":""},null,"2012-06-18","2012-06-19","2012-06-20","2012-06-21","2012-06-22","2012-06-23","2012-06-24"]
[26,null,{"$f":"IF(SUM(1*(DAY(E31:K31)=1))>0,K31,\"\")","v":"2012-07-01"},null,"2012-06-25","2012-06-26","2012-06-27","2012-06-28","2012-06-29","2012-06-30","2012-07-01"]
[27,null,{"$f":"IF(SUM(1*(DAY(E32:K32)=1))>0,K32,\"\")","v":""},null,"2012-07-02","2012-07-03","2012-07-04","2012-07-05","2012-07-06","2012-07-07","2012-07-08"]
[28,null,{"$f":"IF(SUM(1*(DAY(E33:K33)=1))>0,K33,\"\")","v":""},null,"2012-07-09","2012-07-10","2012-07-11","2012-07-12","2012-07-13","2012-07-14","2012-07-15"]
[29,null,{"$f":"IF(SUM(1*(DAY(E34:K34)=1))>0,K34,\"\")","v":""},null,"2012-07-16","2012-07-17","2012-07-18","2012-07-19","2012-07-20","2012-07-21","2012-07-22"]
[30,null,{"$f":"IF(SUM(1*(DAY(E35:K35)=1))>0,K35,\"\")","v":""},null,"2012-07-23","2012-07-24","2012-07-25","2012-07-26","2012-07-27","2012-07-28","2012-07-29"]
[31,null,{"$f":"IF(SUM(1*(DAY(E36:K36)=1))>0,K36,\"\")","v":"2012-08-05"},null,"2012-07-30","2012-07-31","2012-08-01","2012-08-02","2012-08-03","2012-08-04","2012-08-05"]
[32,null,{"$f":"IF(SUM(1*(DAY(E37:K37)=1))>0,K37,\"\")","v":""},null,"2012-08-06","2012-08-07","2012-08-08","2012-08-09","2012-08-10","2012-08-11","2012-08-12"]
[33,null,{"$f":"IF(SUM(1*(DAY(E38:K38)=1))>0,K38,\"\")","v":""},null,"2012-08-13","2012-08-14","2012-08-15","2012-08-16","2012-08-17","2012-08-18","2012-08-19"]
[34,null,{"$f":"IF(SUM(1*(DAY(E39:K39)=1))>0,K39,\"\")","v":""},null,"2012-08-20","2012-08-21","2012-08-22","2012-08-23","2012-08-24","2012-08-25","2012-08-26"]
[35,null,{"$f":"IF(SUM(1*(DAY(E40:K40)=1))>0,K40,\"\")","v":"2012-09-02"},null,"2012-08-27","2012-08-28","2012-08-29","2012-08-30","2012-08-31","2012-09-01","2012-09-02"]
[36,null,{"$f":"IF(SUM(1*(DAY(E41:K41)=1))>0,K41,\"\")","v":""},null,"2012-09-03","2012-09-04","2012-09-05","2012-09-06","2012-09-07","2012-09-08","2012-09-09"]
[37,null,{"$f":"IF(SUM(1*(DAY(E42:K42)=1))>0,K42,\"\")","v":""},null,"2012-09-10","2012-09-11","2012-09-12","2012-09-13","2012-09-14","2012-09-15","2012-09-16"]
[38,null,{"$f":"IF(SUM(1*(DAY(E43:K43)=1))>0,K43,\"\")","v":""},null,"2012-09-17","2012-09-18","2012-09-19","2012-09-20","2012-09-21","2012-09-22","2012-09-23"]
[39,null,{"$f":"IF(SUM(1*(DAY(E44:K44)=1))>0,K44,\"\")","v":""},null,"2012-09-24","2012-09-25","2012-09-26","2012-09-27","2012-09-28","2012-09-29","2012-09-30"]
[40,null,{"$f":"IF(SUM(1*(DAY(E45:K45)=1))>0,K45,\"\")","v":"2012-10-07"},null,"2012-10-01","2012-10-02","2012-10-03","2012-10-04","2012-10-05","2012-10-06","2012-10-07"]
[41,null,{"$f":"IF(SUM(1*(DAY(E46:K46)=1))>0,K46,\"\")","v":""},null,"2012-10-08","2012-10-09","2012-10-10","2012-10-11","2012-10-12","2012-10-13","2012-10-14"]
[42,null,{"$f":"IF(SUM(1*(DAY(E47:K47)=1))>0,K47,\"\")","v":""},null,"2012-10-15","2012-10-16","2012-10-17","2012-10-18",{"$f":"H47+1","v":"2012-10-19"},{"$f":"I47+1","v":"2012-10-20"},{"$f":"J47+1","v":"2012-10-21"}]
[43,null,{"$f":"IF(SUM(1*(DAY(E48:K48)=1))>0,K48,\"\")","v":""},null,"2012-10-22",{"$f":"E48+1","v":"2012-10-23"},"2012-10-24","2012-10-25","2012-10-26","2012-10-27","2012-10-28"]
[44,null,{"$f":"IF(SUM(1*(DAY(E49:K49)=1))>0,K49,\"\")","v":"2012-11-04"},null,"2012-10-29","2012-10-30","2012-10-31","2012-11-01","2012-11-02","2012-11-03","2012-11-04"]
[45,null,{"$f":"IF(SUM(1*(DAY(E50:K50)=1))>0,K50,\"\")","v":""},null,"2012-11-05","2012-11-06","2012-11-07","2012-11-08","2012-11-09","2012-11-10","2012-11-11"]
[46,null,{"$f":"IF(SUM(1*(DAY(E51:K51)=1))>0,K51,\"\")","v":""},null,"2012-11-12","2012-11-13","2012-11-14","2012-11-15","2012-11-16","2012-11-17","2012-11-18"]
[47,null,{"$f":"IF(SUM(1*(DAY(E52:K52)=1))>0,K52,\"\")","v":""},null,"2012-11-19","2012-11-20","2012-11-21","2012-11-22","2012-11-23","2012-11-24","2012-11-25"]
[48,null,{"$f":"IF(SUM(1*(DAY(E53:K53)=1))>0,K53,\"\")","v":"2012-12-02"},null,"2012-11-26","2012-11-27","2012-11-28","2012-11-29","2012-11-30","2012-12-01","2012-12-02"]
[49,null,{"$f":"IF(SUM(1*(DAY(E54:K54)=1))>0,K54,\"\")","v":""},null,"2012-12-03","2012-12-04","2012-12-05","2012-12-06","2012-12-07","2012-12-08","2012-12-09"]
[50,null,{"$f":"IF(SUM(1*(DAY(E55:K55)=1))>0,K55,\"\")","v":""},null,"2012-12-10","2012-12-11","2012-12-12","2012-12-13","2012-12-14","2012-12-15","2012-12-16"]
[51,null,{"$f":"IF(SUM(1*(DAY(E56:K56)=1))>0,K56,\"\")","v":""},null,"2012-12-17","2012-12-18","2012-12-19","2012-12-20","2012-12-21","2012-12-22","2012-12-23"]
[52,null,{"$f":"IF(SUM(1*(DAY(E57:K57)=1))>0,K57,\"\")","v":""},null,"2012-12-24",{"$f":"E57+1","v":"2012-12-25"},"2012-12-26","2012-12-27","2012-12-28","2012-12-29","2012-12-30"]
[1,null,{"$f":"IF(SUM(1*(DAY(E58:K58)=1))>0,K58,\"\")","v":"2013-01-06"},null,{"$f":"K57+1","v":"2012-12-31"},{"$f":"E58+1","v":"2013-01-01"},{"$f":"F58+1","v":"2013-01-02"},{"$f":"G58+1","v":"2013-01-03"},{"$f":"H58+1","v":"2013-01-04"},{"$f":"I58+1","v":"2013-01-05"},{"$f":"J58+1","v":"2013-01-06"}]
[]
[null,null,"visit davidseah.com/pceo/cal for more information"]

{"sheet":"Tatiller","index":1,"n_rows":22,"n_cols":3,"rows_kept":22,"cut":false,"hidden":false,"merged":[]}
[null,"Tatiller Tablosu"]
[null,"Tatil günleri otomatik olarak güncellenecek."]
["GÜN","TARİH","AÇIKLAMA"]
[{"$f":"IF(HarTekin!A3=\"\",\"\",HarTekin!A3)","v":"2012-01-01"},{"$f":"IF(HarTekin!F3=\"\",\"\",HarTekin!F3)","v":"2012-01-01"},{"$f":"IF(HarTekin!C3=\"\",\"\",HarTekin!C3)","v":"Yılbaşı"}]
[{"$f":"IF(HarTekin!A4=\"\",\"\",HarTekin!A4)","v":"2012-04-23"},{"$f":"IF(HarTekin!F4=\"\",\"\",HarTekin!F4)","v":"2012-04-23"},{"$f":"IF(HarTekin!C4=\"\",\"\",HarTekin!C4)","v":"Ulusal Egemenlik ve Çocuk Bayramı"}]
[{"$f":"IF(HarTekin!A5=\"\",\"\",HarTekin!A5)","v":"2012-05-01"},{"$f":"IF(HarTekin!F5=\"\",\"\",HarTekin!F5)","v":"2012-05-01"},{"$f":"IF(HarTekin!C5=\"\",\"\",HarTekin!C5)","v":"Emek ve Dayanışma Günü"}]
[{"$f":"IF(HarTekin!A6=\"\",\"\",HarTekin!A6)","v":"2012-05-19"},{"$f":"IF(HarTekin!F6=\"\",\"\",HarTekin!F6)","v":"2012-05-19"},{"$f":"IF(HarTekin!C6=\"\",\"\",HarTekin!C6)","v":"Atatürk’ü Anma, Gençlik ve Spor Bayramı"}]
[{"$f":"IF(HarTekin!A7=\"\",\"\",HarTekin!A7)","v":"2012-08-30"},{"$f":"IF(HarTekin!F7=\"\",\"\",HarTekin!F7)","v":"2012-08-30"},{"$f":"IF(HarTekin!C7=\"\",\"\",HarTekin!C7)","v":"Zafer Bayramı"}]
[{"$f":"IF(HarTekin!A8=\"\",\"\",HarTekin!A8)","v":"2012-10-28"},{"$f":"IF(HarTekin!F8=\"\",\"\",HarTekin!F8)","v":"2012-10-28"},{"$f":"IF(HarTekin!C8=\"\",\"\",HarTekin!C8)","v":"Cumhuriyet Bayramı Arifesi"}]
[{"$f":"IF(HarTekin!A9=\"\",\"\",HarTekin!A9)","v":"2012-10-29"},{"$f":"IF(HarTekin!F9=\"\",\"\",HarTekin!F9)","v":"2012-10-29"},{"$f":"IF(HarTekin!C9=\"\",\"\",HarTekin!C9)","v":"Cumhuriyet Bayramı"}]
[{"$f":"IF(HarTekin!A10=\"\",\"\",HarTekin!A10)","v":"2012-12-31"},{"$f":"IF(HarTekin!F10=\"\",\"\",HarTekin!F10)","v":"2012-12-31"},{"$f":"IF(HarTekin!C10=\"\",\"\",HarTekin!C10)","v":"Yılbaşı"}]
[{"$f":"IF(HarTekin!A11=\"\",\"\",HarTekin!A11)","v":""},{"$f":"IF(HarTekin!F11=\"\",\"\",HarTekin!F11)","v":""},{"$f":"IF(HarTekin!C11=\"\",\"\",HarTekin!C11)","v":""}]
[{"$f":"IF(HarTekin!A12=\"\",\"\",HarTekin!A12)","v":""},{"$f":"IF(HarTekin!F12=\"\",\"\",HarTekin!F12)","v":""},{"$f":"IF(HarTekin!C12=\"\",\"\",HarTekin!C12)","v":""}]
[{"$f":"IF(HarTekin!A13=\"\",\"\",HarTekin!A13)","v":""},{"$f":"IF(HarTekin!F13=\"\",\"\",HarTekin!F13)","v":""},{"$f":"IF(HarTekin!C13=\"\",\"\",HarTekin!C13)","v":""}]
[{"$f":"IF(HarTekin!A14=\"\",\"\",HarTekin!A14)","v":""},{"$f":"IF(HarTekin!F14=\"\",\"\",HarTekin!F14)","v":""},{"$f":"IF(HarTekin!C14=\"\",\"\",HarTekin!C14)","v":""}]
[]
[{"$f":"IF(HarTekin!A16=\"\",\"\",HarTekin!A16)","v":""},{"$f":"IF(HarTekin!F16=\"\",\"\",HarTekin!F16)","v":""},{"$f":"IF(HarTekin!C16=\"\",\"\",HarTekin!C16)","v":""}]
[{"$f":"IF(HarTekin!A17=\"\",\"\",HarTekin!A17)","v":""},{"$f":"IF(HarTekin!F17=\"\",\"\",HarTekin!F17)","v":""},{"$f":"IF(HarTekin!C17=\"\",\"\",HarTekin!C17)","v":""}]
[{"$f":"IF(HarTekin!A18=\"\",\"\",HarTekin!A18)","v":""},{"$f":"IF(HarTekin!F18=\"\",\"\",HarTekin!F18)","v":""},{"$f":"IF(HarTekin!C18=\"\",\"\",HarTekin!C18)","v":""}]
[]
[null,"visit davidseah.com/pceo/cal for more information"]
[null,"visit hartekin.name.tr for more information"]

{"sheet":"HarTekin","index":2,"n_rows":10,"n_cols":6,"rows_kept":10,"cut":false,"hidden":false,"merged":[]}
[]
[]
[{"$f":"F3","v":"2012-01-01"},"2012-01-01","Yılbaşı",{"$f":"TEXT(B3,\"gg.aa.\")","v":"01.01."},{"$f":"TEXT(LEFT(D3,6)&YILI,\"gg.aa.yyyy\")","v":"01.01.2012"},{"$f":"DATEVALUE(E3)","v":40909}]
[{"$f":"F4","v":"2012-04-23"},"2010-04-23","Ulusal Egemenlik ve Çocuk Bayramı",{"$f":"TEXT(B4,\"gg.aa.\")","v":"23.04."},{"$f":"TEXT(LEFT(D4,6)&YILI,\"gg.aa.yyyy\")","v":"23.04.2012"},{"$f":"DATEVALUE(E4)","v":41022}]
["2012-05-01","2010-05-01","Emek ve Dayanışma Günü","01.05.",{"$f":"TEXT(LEFT(D5,6)&YILI,\"gg.aa.yyyy\")","v":"01.05.2012"},41030]
["2012-05-19","2010-05-19","Atatürk’ü Anma, Gençlik ve Spor Bayramı","19.05.","19.05.2012",41048]
["2012-08-30","2010-08-30","Zafer Bayramı","30.08.","30.08.2012",41151]
["2012-10-28","2010-10-28","Cumhuriyet Bayramı Arifesi","28.10.","28.10.2012",41210]
["2012-10-29","2010-10-29","Cumhuriyet Bayramı","29.10.","29.10.2012",41211]
[{"$f":"F10","v":"2012-12-31"},"2010-12-31","Yılbaşı",{"$f":"TEXT(B10,\"gg.aa.\")","v":"31.12."},{"$f":"TEXT(LEFT(D10,6)&YILI,\"gg.aa.yyyy\")","v":"31.12.2012"},{"$f":"DATEVALUE(E10)","v":41274}]

{"sheet":"Instructions","index":3,"n_rows":22,"n_cols":2,"rows_kept":22,"cut":false,"hidden":false,"merged":[[0,0,0,1]]}
["About Dave's Compact Calendar"]
["TR : WEEK STARTING MONDAY"]
[]
["About Compact Calendar","I use this calendar template for project estimating. It's compact, easy to print, and most importantly allows me to visualize time as blocks."]
[]
["Using the Compact Calendar","I usually just circle the starting dates of a task, then run a line out to the right side where I can make a note as to what it is. With the amount of whitespace available on the right, there's plenty of room to leave notes. After I'm done, I then either make a clean version with another sheet of paper, or type up the dates right on a copy of this spreadsheet"]
[]
["Printing Partial Calendars","For small projects, I don't usually need the entire calendar, so I just select the rows I need then PRINT SELECTION from the print dialog. The headers/footers are set up so that it \"prints clean\" with the legends. Works great!"]
[]
["Change the Year","If you need to change the year, just update the YEAR cell in the upper right corner of the calendar header; the rest of the calendar should automatically be calculated and updated. "]
[null,"Date changer added by HarTekin"]
[]
["Adding Holidays","The 'Tables' worksheet tab has a list of holidays that you can change. The capability for calculating holidays automatically have been added; please study the formulas to see how it works."]
[null,"Making auto for TR by HarTekin"]
[]
["Enjoy! ","Click on the CALENDAR worksheet tab below to see the calendar itself"]
[]
["Credits","ISO 8601 Week Information and calculation from http://www.rondebruin.nl/weeknumber.htm"]
[null,"Auto-calculation of first day based on year cell provided by Todd Foster http://www.boidem.org/"]
[null,"Automatic month calculation tip from Jim Service and \"Jenny\""]
[null,"Auto calculations of holidays from: http://cpearson.com"]
[null,"visit hartekin.name.tr for more information"]